Reaction Details
TargetC-C chemokine receptor type 3
LigandBDBM50133793
Substrate/Competitorn/a
Meas. Tech.ChEMBL_41923 (CHEMBL650505)
IC50 2.4±n/a nM
Citation Gong, LHogg, JHCollier, JWilhelm, RSSoderberg, C Design and synthesis of novel CCR3 antagonists. Bioorg Med Chem Lett13:3597-600 (2003) C-C chemokine receptor type 3
Name:C-C chemokine receptor type 3
Type:Enzyme
Mol. Mass.:41053.88
Organism:Homo sapiens (Human)
Description:P51677
Residue:355
BDBM50133793
NameBDBM50133793
Synonyms:1-{(S)-1-[3-(4-Chloro-benzyl)-8-aza-bicyclo[3.2.1]oct-8-ylmethyl]-2-hydroxy-propyl}-3-(3,4,5-trimethoxy-phenyl)-urea | CHEMBL431670
TypeSmall organic molecule
Emp. Form.C28H38ClN3O5
Mol. Mass.532.071
SMILESCOc1cc(NC(=O)N[C@@H](CN2C3CCC2CC(Cc2ccc(Cl)cc2)C3)[C@H](C)O)cc(OC)c1OC