Reaction Details
TargetMu-type opioid receptor
LigandBDBM50136597
Substrate/Competitorn/a
Meas. Tech.ChEMBL_148068 (CHEMBL754686)
IC50 1.9±n/a nM
Citation Le Bourdonnec, BBelanger, SCassel, JAStabley, GJDeHaven, RNDolle, RE trans-3,4-dimethyl-4-(3-carboxamidophenyl)piperidines: a novel class of micro-selective opioid antagonists. Bioorg Med Chem Lett13:4459-62 (2003) Mu-type opioid receptor
Name:Mu-type opioid receptor
Type:G Protein-Coupled Receptor (GPCR)
Mol. Mass.:44789.51
Organism:Homo sapiens (Human)
Description:P35372
Residue:400
BDBM50136597
NameBDBM50136597
Synonyms:3-((3R,4R)-3,4-Dimethyl-1-phenethyl-piperidin-4-yl)-benzamide | CHEMBL336234
TypeSmall organic molecule
Emp. Form.C22H28N2O
Mol. Mass.336.4705
SMILESC[C@H]1CN(CCc2ccccc2)CC[C@@]1(C)c1cccc(c1)C(N)=O