Reaction Details
TargetMu-type opioid receptor
LigandBDBM50136592
Substrate/Competitorn/a
Meas. Tech.ChEMBL_148237 (CHEMBL753397)
Ki 6.2±n/a nM
Citation Le Bourdonnec, BBelanger, SCassel, JAStabley, GJDeHaven, RNDolle, RE trans-3,4-dimethyl-4-(3-carboxamidophenyl)piperidines: a novel class of micro-selective opioid antagonists. Bioorg Med Chem Lett13:4459-62 (2003) Mu-type opioid receptor
Name:Mu-type opioid receptor
Type:G Protein-Coupled Receptor (GPCR)
Mol. Mass.:44789.51
Organism:Homo sapiens (Human)
Description:P35372
Residue:400
BDBM50136592
NameBDBM50136592
Synonyms:3-((3R,4R)-1-Benzofuran-2-ylmethyl-3,4-dimethyl-piperidin-4-yl)-benzamide | CHEMBL138910
TypeSmall organic molecule
Emp. Form.C23H26N2O2
Mol. Mass.362.4647
SMILESC[C@H]1CN(Cc2cc3ccccc3o2)CC[C@@]1(C)c1cccc(c1)C(N)=O