Reaction Details
TargetKappa-type opioid receptor
LigandBDBM50136587
Substrate/Competitorn/a
Meas. Tech.ChEBML_145265
Ki 600±n/a nM
Citation Le Bourdonnec, BBelanger, SCassel, JAStabley, GJDeHaven, RNDolle, RE trans-3,4-dimethyl-4-(3-carboxamidophenyl)piperidines: a novel class of micro-selective opioid antagonists. Bioorg Med Chem Lett13:4459-62 (2003) Kappa-type opioid receptor
Name:Kappa-type opioid receptor
Type:G Protein-Coupled Receptor (GPCR)
Mol. Mass.:42648.76
Organism:Homo sapiens (Human)
Description:P41145
Residue:380
BDBM50136587
NameBDBM50136587
Synonyms:3-((3R,4R)-3,4-Dimethyl-1-quinolin-2-ylmethyl-piperidin-4-yl)-benzamide | CHEMBL337341
TypeSmall organic molecule
Emp. Form.C24H27N3O
Mol. Mass.373.4907
SMILESC[C@H]1CN(Cc2ccc3ccccc3n2)CC[C@@]1(C)c1cccc(c1)C(N)=O