Reaction Details
TargetMu-type opioid receptor
LigandBDBM50136598
Substrate/Competitorn/a
Meas. Tech.ChEMBL_148237 (CHEMBL753397)
Ki 5.5±n/a nM
Citation Le Bourdonnec, BBelanger, SCassel, JAStabley, GJDeHaven, RNDolle, RE trans-3,4-dimethyl-4-(3-carboxamidophenyl)piperidines: a novel class of micro-selective opioid antagonists. Bioorg Med Chem Lett13:4459-62 (2003) Mu-type opioid receptor
Name:Mu-type opioid receptor
Type:G Protein-Coupled Receptor (GPCR)
Mol. Mass.:44789.51
Organism:Homo sapiens (Human)
Description:P35372
Residue:400
BDBM50136598
NameBDBM50136598
Synonyms:3-[(3R,4R)-1-(4-Methoxy-benzyl)-3,4-dimethyl-piperidin-4-yl]-benzamide | CHEMBL138842
TypeSmall organic molecule
Emp. Form.C22H28N2O2
Mol. Mass.352.4699
SMILESCOc1ccc(CN2CC[C@](C)([C@@H](C)C2)c2cccc(c2)C(N)=O)cc1