Reaction Details
TargetKappa-type opioid receptor
LigandBDBM50136607
Substrate/Competitorn/a
Meas. Tech.ChEBML_145265
Ki 140±n/a nM
Citation Le Bourdonnec, BBelanger, SCassel, JAStabley, GJDeHaven, RNDolle, RE trans-3,4-dimethyl-4-(3-carboxamidophenyl)piperidines: a novel class of micro-selective opioid antagonists. Bioorg Med Chem Lett13:4459-62 (2003) Kappa-type opioid receptor
Name:Kappa-type opioid receptor
Type:G Protein-Coupled Receptor (GPCR)
Mol. Mass.:42648.76
Organism:Homo sapiens (Human)
Description:P41145
Residue:380
BDBM50136607
NameBDBM50136607
Synonyms:3-((3R,4R)-1-Cyclopropylmethyl-3,4-dimethyl-piperidin-4-yl)-benzamide | CHEMBL334700
TypeSmall organic molecule
Emp. Form.C18H26N2O
Mol. Mass.286.4118
SMILESC[C@H]1CN(CC2CC2)CC[C@@]1(C)c1cccc(c1)C(N)=O