Reaction Details
TargetMetabotropic glutamate receptor 5
LigandBDBM50122758
Substrate/Competitorn/a
Meas. Tech.ChEBML_218836
IC50 5±n/a nM
Citation Cosford, NDRoppe, JTehrani, LSchweiger, EJSeiders, TJChaudary, ARao, SVarney, MA [3H]-methoxymethyl-MTEP and [3H]-methoxy-PEPy: potent and selective radioligands for the metabotropic glutamate subtype 5 (mGlu5) receptor. Bioorg Med Chem Lett13:351-4 (2003) Metabotropic glutamate receptor 5
Name:Metabotropic glutamate receptor 5
Type:Enzyme
Mol. Mass.:132484.72
Organism:Homo sapiens (Human)
Description:n/a
Residue:1212
BDBM50122758
NameBDBM50122758
Synonyms:2-methyl-4-(pyridin-3-ylethynyl)thiazole 3-(2-Methyl-thiazol-4-ylethynyl)-pyridine 3-[(2-methyl-4-thiazolyl)ethynyl]pyridine MTEP
TypeSmall organic molecule
Emp. Form.C11H8N2S
Mol. Mass.200.26
SMILESCc1nc(cs1)C#Cc1cccnc1