Reaction Details
TargetSodium-dependent dopamine transporter
LigandBDBM50123260
Substrate/Competitorn/a
Meas. Tech.ChEBML_62640
Ki>1000±n/a nM
Citation Enyedy, IJSakamuri, SZaman, WAJohnson, KMWang, S Pharmacophore-based discovery of substituted pyridines as novel dopamine transporter inhibitors. Bioorg Med Chem Lett13:513-7 (2003) Sodium-dependent dopamine transporter
Name:Sodium-dependent dopamine transporter
Type:Multi-pass membrane protein
Mol. Mass.:68749.45
Organism:Rattus norvegicus (rat)
Description:P23977
Residue:619
BDBM50123260
NameBDBM50123260
Synonyms:2-[(Z)-2-(2-Chloro-phenyl)-1-phenyl-vinyl]-pyridine | CHEMBL147083
TypeSmall organic molecule
Emp. Form.C19H14ClN
Mol. Mass.291.774
SMILESClc1ccccc1\C=C(\c1ccccc1)c1ccccn1