Reaction Details
TargetSodium-dependent dopamine transporter
LigandBDBM50123265
Substrate/Competitorn/a
Meas. Tech.ChEBML_62640
Ki>1000±n/a nM
Citation Enyedy, IJSakamuri, SZaman, WAJohnson, KMWang, S Pharmacophore-based discovery of substituted pyridines as novel dopamine transporter inhibitors. Bioorg Med Chem Lett13:513-7 (2003) Sodium-dependent dopamine transporter
Name:Sodium-dependent dopamine transporter
Type:Multi-pass membrane protein
Mol. Mass.:68749.45
Organism:Rattus norvegicus (rat)
Description:P23977
Residue:619
BDBM50123265
NameBDBM50123265
Synonyms:CHEMBL345273 | Diphenylvinylidene-methyl-amine
TypeSmall organic molecule
Emp. Form.C15H13N
Mol. Mass.207.2704
SMILESCN=C=C(c1ccccc1)c1ccccc1