Reaction Details
Target2-C-methyl-D-erythritol 4-phosphate cytidylyltransferase
LigandBDBM50125056
Substrate/Competitorn/a
Meas. Tech.ChEBML_52541
Ki 240000000±n/a nM
Citation Lillo, AMTetzlaff, CNSangari, FJCane, DE Functional expression and characterization of EryA, the erythritol kinase of Brucella abortus, and enzymatic synthesis of L-erythritol-4-phosphate. Bioorg Med Chem Lett13:737-9 (2003) 2-C-methyl-D-erythritol 4-phosphate cytidylyltransferase
Name:2-C-methyl-D-erythritol 4-phosphate cytidylyltransferase
Type:PROTEIN
Mol. Mass.:25781.06
Organism:Escherichia coli O6
Description:ChEMBL_52541
Residue:236
BDBM50125056
NameBDBM50125056
Synonyms:Phosphoric acid mono-(2,3,4-trihydroxy-3-methyl-butyl) ester
TypeSmall organic molecule
Emp. Form.C5H11O7P
Mol. Mass.214.1115
SMILESC[C@@](O)(CO)[C@@H](O)COP([O-])([O-])=O