Reaction Details
TargetAdenosine receptor A2a
LigandBDBM50124119
Substrate/Competitorn/a
Meas. Tech.ChEMBL_30018 (CHEMBL641309)
Ki>10000±n/a nM
Citation Lim, MHKim, HOMoon, HRLee, SJChun, MWGao, ZGMelman, NJacobson, KAKim, JHJeong, LS Design, synthesis and binding affinity of 3'-fluoro analogues of Cl-IB-MECA as adenosine A3 receptor ligands. Bioorg Med Chem Lett13:817-20 (2003) Adenosine receptor A2a
Name:Adenosine receptor A2a
Type:G Protein-Coupled Receptor (GPCR)
Mol. Mass.:45015.65
Organism:Rattus norvegicus (rat)
Description:Rat A2A receptors expressed in CHO cells.
Residue:410
BDBM50124119
NameBDBM50124119
Synonyms:5-{2-chloro-6-[(3-iodobenzyl)amino]-9H-purin-9-yl}-3-fluoro-4-hydroxy-N-methyltetrahydrofuran-2-carboxamide | CHEMBL436255
TypeSmall organic molecule
Emp. Form.C18H17ClFIN6O3
Mol. Mass.546.722
SMILESCNC(=O)C1OC(C(O)C1F)n1cnc2c(NCc3cccc(I)c3)nc(Cl)nc12