Reaction Details
TargetAdenosine receptor A1
LigandBDBM50124121
Substrate/Competitorn/a
Meas. Tech.ChEBML_29472
Ki 1350±n/a nM
Citation Lim, MHKim, HOMoon, HRLee, SJChun, MWGao, ZGMelman, NJacobson, KAKim, JHJeong, LS Design, synthesis and binding affinity of 3'-fluoro analogues of Cl-IB-MECA as adenosine A3 receptor ligands. Bioorg Med Chem Lett13:817-20 (2003) Adenosine receptor A1
Name:Adenosine receptor A1
Type:Protein
Mol. Mass.:36704.13
Organism:Rattus norvegicus (rat)
Description:n/a
Residue:326
BDBM50124121
NameBDBM50124121
Synonyms:2-{2-chloro-6-[(3-iodobenzyl)amino]-9H-purin-9-yl}-4-fluoro-5-(hydroxymethyl)tetrahydrofuran-3-ol | CHEMBL168567
TypeSmall organic molecule
Emp. Form.C17H16ClFIN5O3
Mol. Mass.519.697
SMILESOCC1OC(C(O)C1F)n1cnc2c(NCc3cccc(I)c3)nc(Cl)nc12