Reaction Details
TargetAdenosine receptor A3
LigandBDBM50124120
Substrate/Competitorn/a
Meas. Tech.ChEBML_32003
Ki 326±n/a nM
Citation Lim, MHKim, HOMoon, HRLee, SJChun, MWGao, ZGMelman, NJacobson, KAKim, JHJeong, LS Design, synthesis and binding affinity of 3'-fluoro analogues of Cl-IB-MECA as adenosine A3 receptor ligands. Bioorg Med Chem Lett13:817-20 (2003) Adenosine receptor A3
Name:Adenosine receptor A3
Type:G Protein-Coupled Receptor (GPCR)
Mol. Mass.:36197.32
Organism:Homo sapiens (Human)
Description:P0DMS8
Residue:318
BDBM50124120
NameBDBM50124120
Synonyms:2-[2-chloro-6-(methylamino)-9H-purin-9-yl]-4-fluoro-5-(hydroxymethyl)tetrahydrofuran-3-ol | CHEMBL168843
TypeSmall organic molecule
Emp. Form.C11H13ClFN5O3
Mol. Mass.317.704
SMILESCNc1nc(Cl)nc2n(cnc12)C1OC(CO)C(F)C1O