Reaction Details
TargetCarbonic anhydrase 2
LigandBDBM50124183
Substrate/Competitorn/a
Meas. Tech.ChEBML_45046
Ki 24±n/a nM
Citation Casini, AAntel, JAbbate, FScozzafava, ADavid, SWaldeck, HSchäfer, SSupuran, CT Carbonic anhydrase inhibitors: SAR and X-ray crystallographic study for the interaction of sugar sulfamates/sulfamides with isozymes I, II and IV. Bioorg Med Chem Lett13:841-5 (2003) Carbonic anhydrase 2
Name:Carbonic anhydrase 2
Type:Enzyme
Mol. Mass.:29250.71
Organism:Homo sapiens (Human)
Description:P00918
Residue:260
BDBM50124183
NameBDBM50124183
Synonyms:CHEMBL355167 | [(3aS,5aR,8aR,8bS)-2,2,7,7-tetramethyltetrahydro-3aH-bis[1,3]dioxolo[4,5-b:4',5'-d]pyran-3a-yl]methyl aminosulfonylcarbamate
TypeSmall organic molecule
Emp. Form.C13H22N2O9S
Mol. Mass.382.387
SMILESCC1(C)O[C@@H]2CO[C@@]3(COC(=O)NS(N)(=O)=O)OC(C)(C)O[C@H]3[C@@H]2O1