Reaction Details
TargetCarbonic anhydrase 9
LigandBDBM10865
Substrate/Competitorn/a
Meas. Tech.ChEBML_45443
Ki 285±n/a nM
Citation Vullo, DFranchi, MGallori, EPastorek, JScozzafava, APastorekova, SSupuran, CT Carbonic anhydrase inhibitors: inhibition of the tumor-associated isozyme IX with aromatic and heterocyclic sulfonamides. Bioorg Med Chem Lett13:1005-9 (2003) Carbonic anhydrase 9
Name:Carbonic anhydrase 9
Type:Enzyme
Mol. Mass.:49669.03
Organism:Homo sapiens (Human)
Description:Catalytic domain of human cloned isozyme was used in the assay
Residue:459
BDBM10865
NameBDBM10865
Synonyms:4-Amino-3-iodobenzenesulfonamide CHEMBL268177 halogenosulfanilamide deriv. 5e
TypeSmall organic molecule
Emp. Form.C6H7IN2O2S
Mol. Mass.298.101
SMILESNc1ccc(cc1I)S(N)(=O)=O