Reaction Details
TargetCarbonic anhydrase 2
LigandBDBM10865
Substrate/Competitorn/a
Meas. Tech.ChEBML_45079
Ki 70±n/a nM
Citation Vullo, DFranchi, MGallori, EPastorek, JScozzafava, APastorekova, SSupuran, CT Carbonic anhydrase inhibitors: inhibition of the tumor-associated isozyme IX with aromatic and heterocyclic sulfonamides. Bioorg Med Chem Lett13:1005-9 (2003) Carbonic anhydrase 2
Name:Carbonic anhydrase 2
Type:Enzyme
Mol. Mass.:29250.71
Organism:Homo sapiens (Human)
Description:P00918
Residue:260
BDBM10865
NameBDBM10865
Synonyms:4-Amino-3-iodobenzenesulfonamide CHEMBL268177 halogenosulfanilamide deriv. 5e
TypeSmall organic molecule
Emp. Form.C6H7IN2O2S
Mol. Mass.298.101
SMILESNc1ccc(cc1I)S(N)(=O)=O