Reaction Details
TargetProstaglandin D2 receptor
LigandBDBM50125411
Substrate/Competitorn/a
Meas. Tech.ChEMBL_157794 (CHEMBL768776)
Ki>13000±n/a nM
Citation Billot, XChateauneuf, AChauret, NDenis, DGreig, GMathieu, MCMetters, KMSlipetz, DMYoung, RN Discovery of a potent and selective agonist of the prostaglandin EP4 receptor. Bioorg Med Chem Lett13:1129-32 (2003) Prostaglandin D2 receptor
Name:Prostaglandin D2 receptor
Type:Enzyme
Mol. Mass.:40288.87
Organism:Homo sapiens (Human)
Description:Q13258
Residue:359
BDBM50125411
NameBDBM50125411
Synonyms:(R)-5-((E)-(R)-3-Hydroxy-4-phenyl-but-1-enyl)-1-[6-(1H-tetrazol-5-yl)-hexyl]-pyrrolidin-2-one CHEMBL280247
TypeSmall organic molecule
Emp. Form.C21H29N5O2
Mol. Mass.383.4873
SMILESO[C@H](Cc1ccccc1)\C=C\[C@H]1CCC(=O)N1CCCCCCc1nnn[nH]1