Reaction Details
TargetProstaglandin F2-alpha receptor
LigandBDBM50125399
Substrate/Competitorn/a
Meas. Tech.ChEBML_157964
Ki>13000±n/a nM
Citation Billot, XChateauneuf, AChauret, NDenis, DGreig, GMathieu, MCMetters, KMSlipetz, DMYoung, RN Discovery of a potent and selective agonist of the prostaglandin EP4 receptor. Bioorg Med Chem Lett13:1129-32 (2003) Prostaglandin F2-alpha receptor
Name:Prostaglandin F2-alpha receptor
Type:Enzyme
Mol. Mass.:40072.29
Organism:Homo sapiens (Human)
Description:P43088
Residue:359
BDBM50125399
NameBDBM50125399
Synonyms:CHEMBL430124 | {4-[(R)-2-((E)-3-Hydroxy-4-phenyl-but-1-enyl)-5-oxo-pyrrolidin-1-yl]-butylsulfanyl}-acetic acid
TypeSmall organic molecule
Emp. Form.C20H27NO4S
Mol. Mass.377.498
SMILESOC(Cc1ccccc1)\C=C\[C@H]1CCC(=O)N1CCCCSCC(O)=O