Reaction Details
TargetProstacyclin receptor
LigandBDBM50125411
Substrate/Competitorn/a
Meas. Tech.ChEBML_158022
Ki>13000±n/a nM
Citation Billot, XChateauneuf, AChauret, NDenis, DGreig, GMathieu, MCMetters, KMSlipetz, DMYoung, RN Discovery of a potent and selective agonist of the prostaglandin EP4 receptor. Bioorg Med Chem Lett13:1129-32 (2003) Prostacyclin receptor
Name:Prostacyclin receptor
Type:G Protein-Coupled Receptor (GPCR)
Mol. Mass.:40968.22
Organism:Homo sapiens (Human)
Description:The membranes prepared from human platelet were used in binding assay.
Residue:386
BDBM50125411
NameBDBM50125411
Synonyms:(R)-5-((E)-(R)-3-Hydroxy-4-phenyl-but-1-enyl)-1-[6-(1H-tetrazol-5-yl)-hexyl]-pyrrolidin-2-one CHEMBL280247
TypeSmall organic molecule
Emp. Form.C21H29N5O2
Mol. Mass.383.4873
SMILESO[C@H](Cc1ccccc1)\C=C\[C@H]1CCC(=O)N1CCCCCCc1nnn[nH]1