Reaction Details
TargetProstaglandin E2 receptor EP4 subtype
LigandBDBM50125416
Substrate/Competitorn/a
Meas. Tech.ChEBML_158331
Ki 3.6±n/a nM
Citation Billot, XChateauneuf, AChauret, NDenis, DGreig, GMathieu, MCMetters, KMSlipetz, DMYoung, RN Discovery of a potent and selective agonist of the prostaglandin EP4 receptor. Bioorg Med Chem Lett13:1129-32 (2003) Prostaglandin E2 receptor EP4 subtype
Name:Prostaglandin E2 receptor EP4 subtype
Type:Enzyme
Mol. Mass.:53134.53
Organism:Homo sapiens (Human)
Description:P35408
Residue:488
BDBM50125416
NameBDBM50125416
Synonyms:7-{(R)-2-[(E)-3-Hydroxy-4-(3-methoxymethyl-phenyl)-but-1-enyl]-5-oxo-pyrrolidin-1-yl}-heptanoic acid | CHEMBL275245
TypeSmall organic molecule
Emp. Form.C23H33NO5
Mol. Mass.403.5118
SMILESCOCc1cccc(CC(O)\C=C\[C@H]2CCC(=O)N2CCCCCCC(O)=O)c1