Reaction Details
TargetProstaglandin E2 receptor EP4 subtype
LigandBDBM50125400
Substrate/Competitorn/a
Meas. Tech.ChEBML_158331
Ki 1410±n/a nM
Citation Billot, XChateauneuf, AChauret, NDenis, DGreig, GMathieu, MCMetters, KMSlipetz, DMYoung, RN Discovery of a potent and selective agonist of the prostaglandin EP4 receptor. Bioorg Med Chem Lett13:1129-32 (2003) Prostaglandin E2 receptor EP4 subtype
Name:Prostaglandin E2 receptor EP4 subtype
Type:Enzyme
Mol. Mass.:53134.53
Organism:Homo sapiens (Human)
Description:P35408
Residue:488
BDBM50125400
NameBDBM50125400
Synonyms:7-[(S)-2-((E)-3-Hydroxy-oct-1-enyl)-5-oxo-pyrrolidin-1-yl]-heptanoic acid | CHEMBL14655
TypeSmall organic molecule
Emp. Form.C19H33NO4
Mol. Mass.339.4696
SMILESCCCCCC(O)\C=C\[C@@H]1CCC(=O)N1CCCCCCC(O)=O