Reaction Details
TargetMu-type opioid receptor
LigandBDBM50451821
Substrate/Competitorn/a
Meas. Tech.ChEBML_149462
Ki 1622±n/a nM
Citation Stachulski, AVScheinmann, FFerguson, JRLaw, JLLumbard, KWHopkins, PPatel, NClarke, SGloyne, AJoel, SP Structure-activity relationships of some opiate glycosides. Bioorg Med Chem Lett13:1207-14 (2003) Mu-type opioid receptor
Name:Mu-type opioid receptor
Type:G Protein-Coupled Receptor (GPCR)
Mol. Mass.:44503.11
Organism:Rattus norvegicus (rat)
Description:Competition binding assays were carried out using membrane preparations from transfected HN9.10 cells that constitutively expressed the mu opioid receptor.
Residue:398
BDBM50451821
NameBDBM50451821
Synonyms:CHEMBL3085275
TypeSmall organic molecule
Emp. Form.C24H27NO11
Mol. Mass.505.4713
SMILES[H][C@@]12Oc3c4c(C[C@@]5([H])N(CC(O)=O)CC[C@@]14[C@@]5([H])C=C[C@@H]2O[C@@H]1O[C@H]([C@@H](O)[C@H](O)[C@@H]1O)C(O)=O)ccc3O