Reaction Details
TargetMu-type opioid receptor
LigandBDBM50451824
Substrate/Competitorn/a
Meas. Tech.ChEBML_149462
Ki 4.8±n/a nM
Citation Stachulski, AVScheinmann, FFerguson, JRLaw, JLLumbard, KWHopkins, PPatel, NClarke, SGloyne, AJoel, SP Structure-activity relationships of some opiate glycosides. Bioorg Med Chem Lett13:1207-14 (2003) Mu-type opioid receptor
Name:Mu-type opioid receptor
Type:G Protein-Coupled Receptor (GPCR)
Mol. Mass.:44503.11
Organism:Rattus norvegicus (rat)
Description:Competition binding assays were carried out using membrane preparations from transfected HN9.10 cells that constitutively expressed the mu opioid receptor.
Residue:398
BDBM50451824
NameBDBM50451824
Synonyms:CHEMBL2092968
TypeSmall organic molecule
Emp. Form.C23H29NO8
Mol. Mass.447.4783
SMILES[H][C@@]12Oc3c4c(C[C@@]5([H])N(C)CCC14[C@@]5([H])C=C[C@@H]2OC1OC(CO)[C@H](O)C(O)C1O)ccc3O