Reaction Details
TargetMu-type opioid receptor
LigandBDBM50125686
Substrate/Competitorn/a
Meas. Tech.ChEMBL_149159 (CHEMBL873303)
Ki 0.170000±n/a nM
Citation Stachulski, AVScheinmann, FFerguson, JRLaw, JLLumbard, KWHopkins, PPatel, NClarke, SGloyne, AJoel, SP Structure-activity relationships of some opiate glycosides. Bioorg Med Chem Lett13:1207-14 (2003) Mu-type opioid receptor
Name:Mu-type opioid receptor
Type:G Protein-Coupled Receptor (GPCR)
Mol. Mass.:44503.11
Organism:Rattus norvegicus (rat)
Description:Competition binding assays were carried out using membrane preparations from transfected HN9.10 cells that constitutively expressed the mu opioid receptor.
Residue:398
BDBM50125686
NameBDBM50125686
Synonyms:2-[10-hydroxy-4-methyl-(5R,13R,14S,17R)-12-oxa-4-azapentacyclo[9.6.1.01,13.05,17.07,18]octadeca-7(18),8,10,15-tetraen-14-yloxy]-6-methyltetrahydro-2H-3,4,5-pyrantriol | CHEMBL19416
TypeSmall organic molecule
Emp. Form.C23H29NO7
Mol. Mass.431.4789
SMILESCC1OC(O[C@H]2C=C[C@H]3[C@H]4Cc5ccc(O)c6O[C@@H]2C3(CCN4C)c56)C(O)C(O)C1O