Reaction Details
TargetMu-type opioid receptor
LigandBDBM50125692
Substrate/Competitorn/a
Meas. Tech.ChEBML_149462
Ki 57.0±n/a nM
Citation Stachulski, AVScheinmann, FFerguson, JRLaw, JLLumbard, KWHopkins, PPatel, NClarke, SGloyne, AJoel, SP Structure-activity relationships of some opiate glycosides. Bioorg Med Chem Lett13:1207-14 (2003) Mu-type opioid receptor
Name:Mu-type opioid receptor
Type:G Protein-Coupled Receptor (GPCR)
Mol. Mass.:44503.11
Organism:Rattus norvegicus (rat)
Description:Competition binding assays were carried out using membrane preparations from transfected HN9.10 cells that constitutively expressed the mu opioid receptor.
Residue:398
BDBM50125692
NameBDBM50125692
Synonyms:3,4,5-trihydroxy-6-[10-hydroxy-(5R,13R,14S,17R)-12-oxa-4-azapentacyclo[9.6.1.01,13.05,17.07,18]octadeca-7(18),8,10,15-tetraen-14-yloxy]tetrahydro-2H-2-pyrancarboxylic acid | CHEMBL2079576
TypeSmall organic molecule
Emp. Form.C23H27NO8
Mol. Mass.445.4624
SMILES[H][C@@]12Oc3c4c(C[C@@]5([H])N(C)CC[C@@]14[C@@]5([H])C=C[C@@H]2OC1O[C@H](CC(O)C1O)C(O)=O)ccc3O