Reaction Details
TargetNociceptin receptor
LigandBDBM50137566
Substrate/Competitorn/a
Meas. Tech.ChEMBL_144650 (CHEMBL752664)
EC50 165±n/a nM
Citation Jong, LZaveri, NToll, L The design and synthesis of a novel quinolizidine template for potent opioid and opioid receptor-like (ORL1, NOP) receptor ligands. Bioorg Med Chem Lett14:181-5 (2003) Nociceptin receptor
Name:Nociceptin receptor
Type:G Protein-Coupled Receptor (GPCR)
Mol. Mass.:40702.87
Organism:Homo sapiens (Human)
Description:P41146
Residue:370
BDBM50137566
NameBDBM50137566
Synonyms:1-Ethyl-3-((2R,6S,9aR)-6-phenyl-octahydro-quinolizin-2-yl)-1,3-dihydro-benzoimidazol-2-one SR-14138
TypeSmall organic molecule
Emp. Form.C24H29N3O
Mol. Mass.375.5066
SMILESCCn1c2ccccc2n([C@@H]2CCN3[C@H](CCC[C@H]3c3ccccc3)C2)c1=O