Reaction Details
TargetKappa-type opioid receptor
LigandBDBM50137563
Substrate/Competitorn/a
Meas. Tech.ChEMBL_147232 (CHEMBL754920)
EC50>10000±n/a nM
Citation Jong, LZaveri, NToll, L The design and synthesis of a novel quinolizidine template for potent opioid and opioid receptor-like (ORL1, NOP) receptor ligands. Bioorg Med Chem Lett14:181-5 (2003) Kappa-type opioid receptor
Name:Kappa-type opioid receptor
Type:G Protein-Coupled Receptor (GPCR)
Mol. Mass.:42648.76
Organism:Homo sapiens (Human)
Description:P41145
Residue:380
BDBM50137563
NameBDBM50137563
Synonyms:1-Ethyl-3-((2S,6S,9aR)-6-phenyl-octahydro-quinolizin-2-yl)-1,3-dihydro-benzoimidazol-2-one SR-14137
TypeSmall organic molecule
Emp. Form.C24H29N3O
Mol. Mass.375.5066
SMILESCCn1c2ccccc2n([C@H]2CCN3[C@H](CCC[C@H]3c3ccccc3)C2)c1=O