Reaction Details
TargetProstaglandin G/H synthase 2
LigandBDBM50047342
Substrate/Competitorn/a
Meas. Tech.ChEBML_157829
IC50 28700±n/a nM
Citation Jahng, YZhao, LXMoon, YSBasnet, AKim, EKChang, HWJu, HKJeong, TCLee, ES Simple aromatic compounds containing propenone moiety show considerable dual COX/5-LOX inhibitory activities. Bioorg Med Chem Lett14:2559-62 (2004) 
 
Prostaglandin G/H synthase 2
Name:Prostaglandin G/H synthase 2
Type:Protein
Mol. Mass.:69020.39
Organism:Mus musculus (Mouse)
Description:Q05769
Residue:604
BDBM50047342
NameBDBM50047342
Synonyms:(E)-3-Phenyl-1-pyridin-2-yl-propenone CHEMBL284742 | cid_5354119
TypeSmall organic molecule
Emp. Form.C14H11NO
Mol. Mass.209.2432
SMILESO=C(\C=C\c1ccccc1)c1ccccn1