Reaction Details
TargetVasopressin V2 receptor
LigandBDBM50146305
Substrate/Competitorn/a
Meas. Tech.ChEBML_214260
Ki 23±n/a nM
Citation Matthews, JMHoekstra, WJDyatkin, ABHecker, LRHlasta, DJPoulter, BLAndrade-Gordon, Pde Garavilla, LDemarest, KTEricson, EGunnet, JWHageman, WLook, RMoore, JBReynolds, CHMaryanoff, BE Potent nonpeptide vasopressin receptor antagonists based on oxazino- and thiazinobenzodiazepine templates. Bioorg Med Chem Lett14:2747-52 (2004) 
 
Vasopressin V2 receptor
Name:Vasopressin V2 receptor
Type:Receptor
Mol. Mass.:40295.28
Organism:Homo sapiens (Human)
Description:P30518
Residue:371
BDBM50146305
NameBDBM50146305
Synonyms:Biphenyl-2-carboxylic acid [4-(8-methyl-3,4,11,11a-tetrahydro-1H,5H-2-thia-4a,10-diaza-dibenzo[a,d]cycloheptene-10-carbonyl)-phenyl]-amide | CHEMBL93366
TypeSmall organic molecule
Emp. Form.C33H31N3O2S
Mol. Mass.533.683
SMILESCc1ccc2CN3CCSCC3CN(C(=O)c3ccc(NC(=O)c4ccccc4-c4ccccc4)cc3)c2c1