Reaction Details
TargetVasopressin V2 receptor
LigandBDBM50146284
Substrate/Competitorn/a
Meas. Tech.ChEBML_214260
Ki 4.00±n/a nM
Citation Matthews, JMHoekstra, WJDyatkin, ABHecker, LRHlasta, DJPoulter, BLAndrade-Gordon, Pde Garavilla, LDemarest, KTEricson, EGunnet, JWHageman, WLook, RMoore, JBReynolds, CHMaryanoff, BE Potent nonpeptide vasopressin receptor antagonists based on oxazino- and thiazinobenzodiazepine templates. Bioorg Med Chem Lett14:2747-52 (2004) 
 
Vasopressin V2 receptor
Name:Vasopressin V2 receptor
Type:Receptor
Mol. Mass.:40295.28
Organism:Homo sapiens (Human)
Description:P30518
Residue:371
BDBM50146284
NameBDBM50146284
Synonyms:Biphenyl-2-carboxylic acid [3-chloro-4-((S)-3,4,11,11a-tetrahydro-1H,5H-2-oxa-4a,10-diaza-dibenzo[a,d]cycloheptene-10-carbonyl)-phenyl]-amide; hydrochloride | CHEMBL543854
TypeSmall organic molecule
Emp. Form.C32H28ClN3O3
Mol. Mass.538.036
SMILESClc1cc(NC(=O)c2ccccc2-c2ccccc2)ccc1C(=O)N1C[C@H]2COCCN2Cc2ccccc12