Reaction Details
TargetVasopressin V2 receptor
LigandBDBM50065115
Substrate/Competitorn/a
Meas. Tech.ChEBML_214260
Ki 23±n/a nM
Citation Matthews, JMHoekstra, WJDyatkin, ABHecker, LRHlasta, DJPoulter, BLAndrade-Gordon, Pde Garavilla, LDemarest, KTEricson, EGunnet, JWHageman, WLook, RMoore, JBReynolds, CHMaryanoff, BE Potent nonpeptide vasopressin receptor antagonists based on oxazino- and thiazinobenzodiazepine templates. Bioorg Med Chem Lett14:2747-52 (2004) 
 
Vasopressin V2 receptor
Name:Vasopressin V2 receptor
Type:Receptor
Mol. Mass.:40295.28
Organism:Homo sapiens (Human)
Description:P30518
Residue:371
BDBM50065115
NameBDBM50065115
Synonyms:3-chloro-4-(10,11-dihydro-5H-benzo[e]pyrrolo[1,2-a][1,4]diazepin-10-ylcarbonyl)-1-(5-fluoro-2-methylphenylcarboxamido)benzene Lixivaptan | N-[4-(5H,11H-Benzo[e]pyrrolo[1,2-a][1,4]diazepine-10-carbonyl)-3-chloro-phenyl]-5-fluoro-2-methyl-benzamide
TypeSmall organic molecule
Emp. Form.C27H21ClFN3O2
Mol. Mass.473.926
SMILESCc1ccc(F)cc1C(=O)Nc1ccc(C(=O)N2Cc3cccn3Cc3ccccc23)c(Cl)c1