Reaction Details
TargetVasopressin V2 receptor
LigandBDBM50146307
Substrate/Competitorn/a
Meas. Tech.ChEMBL_214261 (CHEMBL818587)
Ki 10±n/a nM
Citation Matthews, JMHoekstra, WJDyatkin, ABHecker, LRHlasta, DJPoulter, BLAndrade-Gordon, Pde Garavilla, LDemarest, KTEricson, EGunnet, JWHageman, WLook, RMoore, JBReynolds, CHMaryanoff, BE Potent nonpeptide vasopressin receptor antagonists based on oxazino- and thiazinobenzodiazepine templates. Bioorg Med Chem Lett14:2747-52 (2004) 
 
Vasopressin V2 receptor
Name:Vasopressin V2 receptor
Type:Receptor
Mol. Mass.:40295.28
Organism:Homo sapiens (Human)
Description:P30518
Residue:371
BDBM50146307
NameBDBM50146307
Synonyms:Biphenyl-2-carboxylic acid [4-(9-chloro-3,4,11,11a-tetrahydro-1H,5H-2-thia-4a,10-diaza-dibenzo[a,d]cycloheptene-10-carbonyl)-phenyl]-amide | CHEMBL93195
TypeSmall organic molecule
Emp. Form.C32H28ClN3O2S
Mol. Mass.554.102
SMILESClc1cccc2CN3CCSCC3CN(C(=O)c3ccc(NC(=O)c4ccccc4-c4ccccc4)cc3)c12