Reaction Details
TargetSodium- and chloride-dependent creatine transporter 1
LigandBDBM50147100
Substrate/Competitorn/a
Meas. Tech.ChEBML_49277
Ki 737000±n/a nM
Citation Geldenhuys, WJLockman, PRMcAfee, JHFitzpatrick, KTVan der Schyf, CJAllen, DD Molecular modeling studies on the active binding site of the blood-brain barrier choline transporter. Bioorg Med Chem Lett14:3085-92 (2004) 
 
Sodium- and chloride-dependent creatine transporter 1
Name:Sodium- and chloride-dependent creatine transporter 1
Type:PROTEIN
Mol. Mass.:70632.63
Organism:Rattus norvegicus
Description:ChEMBL_49276
Residue:635
BDBM50147100
NameBDBM50147100
Synonyms:(4-Fluoro-phenyl)-(2-hydroxy-ethyl)-dimethyl-ammonium | CHEMBL316976
TypeSmall organic molecule
Emp. Form.C10H15FNO
Mol. Mass.184.2301
SMILESC[N+](C)(CCO)c1ccc(F)cc1