Reaction Details
TargetSodium- and chloride-dependent creatine transporter 1
LigandBDBM50147103
Substrate/Competitorn/a
Meas. Tech.ChEBML_49277
Ki 190000±n/a nM
Citation Geldenhuys, WJLockman, PRMcAfee, JHFitzpatrick, KTVan der Schyf, CJAllen, DD Molecular modeling studies on the active binding site of the blood-brain barrier choline transporter. Bioorg Med Chem Lett14:3085-92 (2004) 
 
Sodium- and chloride-dependent creatine transporter 1
Name:Sodium- and chloride-dependent creatine transporter 1
Type:PROTEIN
Mol. Mass.:70632.63
Organism:Rattus norvegicus
Description:ChEMBL_49276
Residue:635
BDBM50147103
NameBDBM50147103
Synonyms:(2-Hydroxy-ethyl)-dimethyl-propyl-ammonium | CHEMBL105059
TypeSmall organic molecule
Emp. Form.C7H18NO
Mol. Mass.132.2234
SMILESCCC[N+](C)(C)CCO