Reaction Details
TargetSodium- and chloride-dependent creatine transporter 1
LigandBDBM50147106
Substrate/Competitorn/a
Meas. Tech.ChEBML_49277
Ki>10000000±n/a nM
Citation Geldenhuys, WJLockman, PRMcAfee, JHFitzpatrick, KTVan der Schyf, CJAllen, DD Molecular modeling studies on the active binding site of the blood-brain barrier choline transporter. Bioorg Med Chem Lett14:3085-92 (2004) 
 
Sodium- and chloride-dependent creatine transporter 1
Name:Sodium- and chloride-dependent creatine transporter 1
Type:PROTEIN
Mol. Mass.:70632.63
Organism:Rattus norvegicus
Description:ChEMBL_49276
Residue:635
BDBM50147106
NameBDBM50147106
Synonyms:2-Dimethylamino-cyclohexanol | CHEMBL103052
TypeSmall organic molecule
Emp. Form.C8H17NO
Mol. Mass.143.2267
SMILESCN(C)C1CCCCC1O