Reaction Details
TargetSodium- and chloride-dependent creatine transporter 1
LigandBDBM50047005
Substrate/Competitorn/a
Meas. Tech.ChEBML_49277
Ki 200000±n/a nM
Citation Geldenhuys, WJLockman, PRMcAfee, JHFitzpatrick, KTVan der Schyf, CJAllen, DD Molecular modeling studies on the active binding site of the blood-brain barrier choline transporter. Bioorg Med Chem Lett14:3085-92 (2004) 
 
Sodium- and chloride-dependent creatine transporter 1
Name:Sodium- and chloride-dependent creatine transporter 1
Type:PROTEIN
Mol. Mass.:70632.63
Organism:Rattus norvegicus
Description:ChEMBL_49276
Residue:635
BDBM50047005
NameBDBM50047005
Synonyms:1-Aza-bicyclo[2.2.2]octan-3-ol 3-hydroxy-1-azoniabicyclo[2.2.2]octane | CHEMBL276310
TypeSmall organic molecule
Emp. Form.C7H13NO
Mol. Mass.127.1842
SMILESOC1CN2CCC1CC2