Reaction Details
TargetSodium- and chloride-dependent creatine transporter 1
LigandBDBM50147123
Substrate/Competitorn/a
Meas. Tech.ChEBML_49277
Ki 5369000±n/a nM
Citation Geldenhuys, WJLockman, PRMcAfee, JHFitzpatrick, KTVan der Schyf, CJAllen, DD Molecular modeling studies on the active binding site of the blood-brain barrier choline transporter. Bioorg Med Chem Lett14:3085-92 (2004) 
 
Sodium- and chloride-dependent creatine transporter 1
Name:Sodium- and chloride-dependent creatine transporter 1
Type:PROTEIN
Mol. Mass.:70632.63
Organism:Rattus norvegicus
Description:ChEMBL_49276
Residue:635
BDBM50147123
NameBDBM50147123
Synonyms:((1R,2S)-2-Hydroxy-cyclohexyl)-trimethyl-ammonium | CHEMBL104207
TypeSmall organic molecule
Emp. Form.C9H20NO
Mol. Mass.158.2607
SMILESC[N+](C)(C)C1CCCCC1O