Reaction Details
TargetCollagenase 3
LigandBDBM50451953
Substrate/Competitorn/a
Meas. Tech.ChEMBL_106600 (CHEMBL717437)
IC50 1.2±n/a nM
Citation Reiter, LARobinson, RPMcClure, KFJones, CSReese, MRMitchell, PGOtterness, IGBliven, MLLiras, JCortina, SRDonahue, KMEskra, JDGriffiths, RJLame, MELopez-Anaya, AMartinelli, GJMcGahee, SMYocum, SALopresti-Morrow, LLTobiassen, LMVaughn-Bowser, ML Pyran-containing sulfonamide hydroxamic acids: potent MMP inhibitors that spare MMP-1. Bioorg Med Chem Lett14:3389-95 (2004) 
 
Collagenase 3
Name:Collagenase 3
Type:Enzyme
Mol. Mass.:53808.06
Organism:Homo sapiens (Human)
Description:P45452
Residue:471
BDBM50451953
NameBDBM50451953
Synonyms:CHEMBL2111754
TypeSmall organic molecule
Emp. Form.C18H19FN2O6S
Mol. Mass.410.417
SMILESONC(=O)[C@]1(CCCOC1)NS(=O)(=O)c1ccc(Oc2ccc(F)cc2)cc1