Reaction Details
TargetCollagenase 3
LigandBDBM50451954
Substrate/Competitorn/a
Meas. Tech.ChEMBL_106600 (CHEMBL717437)
IC50 0.350000±n/a nM
Citation Reiter, LARobinson, RPMcClure, KFJones, CSReese, MRMitchell, PGOtterness, IGBliven, MLLiras, JCortina, SRDonahue, KMEskra, JDGriffiths, RJLame, MELopez-Anaya, AMartinelli, GJMcGahee, SMYocum, SALopresti-Morrow, LLTobiassen, LMVaughn-Bowser, ML Pyran-containing sulfonamide hydroxamic acids: potent MMP inhibitors that spare MMP-1. Bioorg Med Chem Lett14:3389-95 (2004) 
 
Collagenase 3
Name:Collagenase 3
Type:Enzyme
Mol. Mass.:53808.06
Organism:Homo sapiens (Human)
Description:P45452
Residue:471
BDBM50451954
NameBDBM50451954
Synonyms:CHEMBL2111753
TypeSmall organic molecule
Emp. Form.C18H19ClN2O6S
Mol. Mass.426.871
SMILESONC(=O)[C@]1(CCCOC1)NS(=O)(=O)c1ccc(Oc2ccc(Cl)cc2)cc1