Reaction Details
TargetCollagenase 3
LigandBDBM50148210
Substrate/Competitorn/a
Meas. Tech.ChEMBL_106600 (CHEMBL717437)
IC50 1.5±n/a nM
Citation Reiter, LARobinson, RPMcClure, KFJones, CSReese, MRMitchell, PGOtterness, IGBliven, MLLiras, JCortina, SRDonahue, KMEskra, JDGriffiths, RJLame, MELopez-Anaya, AMartinelli, GJMcGahee, SMYocum, SALopresti-Morrow, LLTobiassen, LMVaughn-Bowser, ML Pyran-containing sulfonamide hydroxamic acids: potent MMP inhibitors that spare MMP-1. Bioorg Med Chem Lett14:3389-95 (2004) 
 
Collagenase 3
Name:Collagenase 3
Type:Enzyme
Mol. Mass.:53808.06
Organism:Homo sapiens (Human)
Description:P45452
Residue:471
BDBM50148210
NameBDBM50148210
Synonyms:4-[4-(4-Fluoro-phenoxy)-benzenesulfonylamino]-tetrahydro-thiopyran-4-carboxylic acid hydroxyamide | CHEMBL112470
TypeSmall organic molecule
Emp. Form.C18H19FN2O5S2
Mol. Mass.426.482
SMILESONC(=O)C1(CCSCC1)NS(=O)(=O)c1ccc(Oc2ccc(F)cc2)cc1