Reaction Details
TargetCollagenase 3
LigandBDBM50148212
Substrate/Competitorn/a
Meas. Tech.ChEMBL_106600 (CHEMBL717437)
IC50 0.870±n/a nM
Citation Reiter, LARobinson, RPMcClure, KFJones, CSReese, MRMitchell, PGOtterness, IGBliven, MLLiras, JCortina, SRDonahue, KMEskra, JDGriffiths, RJLame, MELopez-Anaya, AMartinelli, GJMcGahee, SMYocum, SALopresti-Morrow, LLTobiassen, LMVaughn-Bowser, ML Pyran-containing sulfonamide hydroxamic acids: potent MMP inhibitors that spare MMP-1. Bioorg Med Chem Lett14:3389-95 (2004) 
 
Collagenase 3
Name:Collagenase 3
Type:Enzyme
Mol. Mass.:53808.06
Organism:Homo sapiens (Human)
Description:P45452
Residue:471
BDBM50148212
NameBDBM50148212
Synonyms:4-[4-(4-Methoxy-phenoxy)-benzenesulfonylamino]-tetrahydro-pyran-4-carboxylic acid hydroxyamide | CHEMBL114906
TypeSmall organic molecule
Emp. Form.C19H22N2O7S
Mol. Mass.422.452
SMILESCOc1ccc(Oc2ccc(cc2)S(=O)(=O)NC2(CCOCC2)C(=O)NO)cc1