Reaction Details
TargetCollagenase 3
LigandBDBM50148214
Substrate/Competitorn/a
Meas. Tech.ChEMBL_106600 (CHEMBL717437)
IC50 0.37±n/a nM
Citation Reiter, LARobinson, RPMcClure, KFJones, CSReese, MRMitchell, PGOtterness, IGBliven, MLLiras, JCortina, SRDonahue, KMEskra, JDGriffiths, RJLame, MELopez-Anaya, AMartinelli, GJMcGahee, SMYocum, SALopresti-Morrow, LLTobiassen, LMVaughn-Bowser, ML Pyran-containing sulfonamide hydroxamic acids: potent MMP inhibitors that spare MMP-1. Bioorg Med Chem Lett14:3389-95 (2004) 
 
Collagenase 3
Name:Collagenase 3
Type:Enzyme
Mol. Mass.:53808.06
Organism:Homo sapiens (Human)
Description:P45452
Residue:471
BDBM50148214
NameBDBM50148214
Synonyms:(R)-3-[4-(4-Chloro-phenoxy)-benzenesulfonylamino]-tetrahydro-furan-3-carboxylic acid hydroxyamide | CHEMBL326369
TypeSmall organic molecule
Emp. Form.C17H17ClN2O6S
Mol. Mass.412.845
SMILESONC(=O)[C@]1(CCOC1)NS(=O)(=O)c1ccc(Oc2ccc(Cl)cc2)cc1