Reaction Details
TargetCollagenase 3
LigandBDBM50148226
Substrate/Competitorn/a
Meas. Tech.ChEMBL_106600 (CHEMBL717437)
IC50 0.97±n/a nM
Citation Reiter, LARobinson, RPMcClure, KFJones, CSReese, MRMitchell, PGOtterness, IGBliven, MLLiras, JCortina, SRDonahue, KMEskra, JDGriffiths, RJLame, MELopez-Anaya, AMartinelli, GJMcGahee, SMYocum, SALopresti-Morrow, LLTobiassen, LMVaughn-Bowser, ML Pyran-containing sulfonamide hydroxamic acids: potent MMP inhibitors that spare MMP-1. Bioorg Med Chem Lett14:3389-95 (2004) 
 
Collagenase 3
Name:Collagenase 3
Type:Enzyme
Mol. Mass.:53808.06
Organism:Homo sapiens (Human)
Description:P45452
Residue:471
BDBM50148226
NameBDBM50148226
Synonyms:1-[4-(4-Fluoro-phenoxy)-benzenesulfonylamino]-cyclohexanecarboxylic acid hydroxyamide | CHEMBL116287
TypeSmall organic molecule
Emp. Form.C19H21FN2O5S
Mol. Mass.408.444
SMILESONC(=O)C1(CCCCC1)NS(=O)(=O)c1ccc(Oc2ccc(F)cc2)cc1