Reaction Details
TargetGlutathione hydrolase 1 proenzyme
LigandBDBM50142500
Substrate/Competitorn/a
Meas. Tech.ChEBML_68880
pH8±n/a
Ki 26900000±n/a nM
Commentsextracted
Citation Lherbet, CGravel, CKeillor, JW Synthesis of S-alkyl L-homocysteine analogues of glutathione and their kinetic studies with gamma-glutamyl transpeptidase. Bioorg Med Chem Lett14:3451-5 (2004) 
 
Glutathione hydrolase 1 proenzyme
Name:Glutathione hydrolase 1 proenzyme
Type:PROTEIN
Mol. Mass.:61615.37
Organism:Rattus norvegicus
Description:ChEMBL_68879
Residue:568
BDBM50142500
NameBDBM50142500
Synonyms:(2S)-2-amino-4-(methylsulfanyl)butanoic acid (S)-2-amino-4-(methylthio)butyric acid CHEMBL42336 L-Methionin L-methionine | US11021454, Compound L-met
TypeSmall organic molecule
Emp. Form.C5H11NO2S
Mol. Mass.149.211
SMILESCSCC[C@H](N)C(O)=O