Reaction Details
Target5-hydroxytryptamine receptor 2B
LigandBDBM50366923
Substrate/Competitorn/a
Meas. Tech.ChEBML_2486
Ki>10000±n/a nM
Citation Dukat, MTaroua, MDahdouh, ASiripurapu, UDamaj, MIMartin, BRGlennon, RA (+/-)8-Amino-5,6,7,8-tetrahydroisoquinolines as novel antinociceptive agents. Bioorg Med Chem Lett14:3651-4 (2004) 
 
5-hydroxytryptamine receptor 2B
Name:5-hydroxytryptamine receptor 2B
Type:G Protein-Coupled Receptor (GPCR)
Mol. Mass.:54312.47
Organism:Homo sapiens (Human)
Description:Receptor binding assays were performed using human clone stably expressed in CHO cells.
Residue:481
BDBM50366923
NameBDBM50366923
Synonyms:CHEMBL1794855
TypeSmall organic molecule
Emp. Form.C12H18N2
Mol. Mass.190.2847
SMILESCCN(C)C1CCCc2ccncc12