Reaction Details
TargetMuscarinic acetylcholine receptor M4
LigandBDBM50366923
Substrate/Competitorn/a
Meas. Tech.ChEBML_139120
Ki>10000±n/a nM
Citation Dukat, MTaroua, MDahdouh, ASiripurapu, UDamaj, MIMartin, BRGlennon, RA (+/-)8-Amino-5,6,7,8-tetrahydroisoquinolines as novel antinociceptive agents. Bioorg Med Chem Lett14:3651-4 (2004) 
 
Muscarinic acetylcholine receptor M4
Name:Muscarinic acetylcholine receptor M4
Type:Enzyme Catalytic Domain
Mol. Mass.:53079.31
Organism:Homo sapiens (Human)
Description:Cholinergic, muscarinic M4 CHRM4 HUMAN M3::P08173
Residue:479
BDBM50366923
NameBDBM50366923
Synonyms:CHEMBL1794855
TypeSmall organic molecule
Emp. Form.C12H18N2
Mol. Mass.190.2847
SMILESCCN(C)C1CCCc2ccncc12