Reaction Details
TargetNeuronal acetylcholine receptor subunit alpha-3/beta-4
LigandBDBM50149051
Substrate/Competitorn/a
Meas. Tech.ChEMBL_39943 (CHEMBL653226)
IC50 1300±n/a nM
Citation Bergmeier, SCIsmail, KAArason, KMMcKay, SBryant, DLMcKay, DB Structure activity studies of ring E analogues of methyllycaconitine. Part 2: Synthesis of antagonists to the alpha3beta4* nicotinic acetylcholine receptors through modifications to the ester. Bioorg Med Chem Lett14:3739-42 (2004) 
 
Neuronal acetylcholine receptor subunit alpha-3/beta-4
Name:Neuronal acetylcholine receptor subunit alpha-3/beta-4
Type:n/a
Mol. Mass.:n/a
Description:ASSAY_ID of ChEMBL is 1970247
Components:This complex has 2 components.
Component 1
Name:Neuronal acetylcholine receptor subunit beta-4
Synonyms:ACHB4_HUMAN Cholinergic, Nicotinic Alpha6Beta3Beta4Alpha5 Nicotinic acetylcholine receptor alpha6/alpha3/beta4
Type:Enzyme Catalytic Domain
Mol. Mass.:56388.51
Organism:Homo sapiens (Human)
Description:Cholinergic, Nicotinic Alpha6Beta3Beta4Alpha5 0 HUMAN::P30926
Residue:498
Component 2
Name:Neuronal acetylcholine receptor subunit alpha-3
Synonyms:ACHA3_HUMAN Cholinergic, Nicotinic Alpha3Beta2 Cholinergic, Nicotinic Alpha3Beta4x NACHRA3 Neuronal acetylcholine receptor subunit alpha-3 nicotinic central
Type:Enzyme Catalytic Domain
Mol. Mass.:57479.03
Organism:Homo sapiens (Human)
Description:Cholinergic, Nicotinic Alpha3Beta2 0 HUMAN::P32297
Residue:505
BDBM50149051
NameBDBM50149051
Synonyms:2-(1,3-Dioxo-1,3-dihydro-isoindol-2-yl)-benzoic acid 1-(3-phenyl-propyl)-piperidin-3-ylmethyl ester | CHEMBL124040
TypeSmall organic molecule
Emp. Form.C30H30N2O4
Mol. Mass.482.5702
SMILESO=C(OCC1CCCN(CCCc2ccccc2)C1)c1ccccc1N1C(=O)c2ccccc2C1=O