Reaction Details
TargetNeuronal acetylcholine receptor subunit alpha-10
LigandBDBM50366779
Substrate/Competitorn/a
Meas. Tech.ChEBML_143223
Ki 1300±n/a nM
Citation Bergmeier, SCIsmail, KAArason, KMMcKay, SBryant, DLMcKay, DB Structure activity studies of ring E analogues of methyllycaconitine. Part 2: Synthesis of antagonists to the alpha3beta4* nicotinic acetylcholine receptors through modifications to the ester. Bioorg Med Chem Lett14:3739-42 (2004) 
 
Neuronal acetylcholine receptor subunit alpha-10
Name:Neuronal acetylcholine receptor subunit alpha-10
Type:PROTEIN
Mol. Mass.:49830.54
Organism:Rattus norvegicus
Description:ChEMBL_143222
Residue:447
BDBM50366779
NameBDBM50366779
Synonyms:METHYLLYCACONITINE
TypeSmall organic molecule
Emp. Form.C37H50N2O10
Mol. Mass.682.8003
SMILESCCN1C[C@]2(COC(=O)c3ccccc3-n3c(O)cc(C)c3O)CC[C@H](OC)[C@@]34[C@@H]5C[C@H]6[C@H](OC)[C@@H]5[C@](O)(C[C@@H]6OC)[C@](O)([C@@H](OC)[C@H]23)[C@H]14