Reaction Details
TargetCholecystokinin receptor type A
LigandBDBM50092398
Substrate/Competitorn/a
Meas. Tech.ChEBML_49723
Ki 2.6±n/a nM
Citation Bellier, BDugave, CEtivant, FGenet, RGigoux, VGarbay, C Synthesis and biological characterisation of [3H]BBL454, a new CCK2 selective radiolabelled agonist displaying original pharmacological properties. Bioorg Med Chem Lett14:369-72 (2003) Cholecystokinin receptor type A
Name:Cholecystokinin receptor type A
Type:n/a
Mol. Mass.:48229.77
Organism:Cavia porcellus
Description:n/a
Residue:430
BDBM50092398
NameBDBM50092398
Synonyms:(S)-3-((S)-2-{[(S)-2-tert-Butoxycarbonylamino-3-(1H-indol-3-yl)-propionyl]-methyl-amino}-hexanoylamino)-N-((S)-1-carbamoyl-2-phenyl-ethyl)-succinamic acid CHEMBL333477
TypeSmall organic molecule
Emp. Form.C36H48N6O8
Mol. Mass.692.8017
SMILESCCCC[C@H](N(C)C(=O)[C@H](Cc1c[nH]c2ccccc12)NC(=O)OC(C)(C)C)C(=O)N[C@@H](CC(O)=O)C(=O)N[C@@H](Cc1ccccc1)C(N)=O