Reaction Details
TargetMu-type opioid receptor
LigandBDBM50404326
Substrate/Competitorn/a
Meas. Tech.ChEBML_148227
Ki 279±n/a nM
Citation Chen, ZGoehring, RRValenzano, KJKyle, DJ Design and synthesis of novel small molecule N/OFQ receptor antagonists. Bioorg Med Chem Lett14:1347-51 (2004) 
 
Mu-type opioid receptor
Name:Mu-type opioid receptor
Type:G Protein-Coupled Receptor (GPCR)
Mol. Mass.:44789.51
Organism:Homo sapiens (Human)
Description:P35372
Residue:400
BDBM50404326
NameBDBM50404326
Synonyms:CHEMBL2113273
TypeSmall organic molecule
Emp. Form.C24H41N3O
Mol. Mass.387.6018
SMILESCCN1[C@@H]2CCCC[C@H]2N(C2CCN(CC2)C2CCC3CCCCC3C2)C1=O